{"text_format":"1","workbook":"xlsx","n_sheets":4,"sheets":["Data","Firm_wise","Comparitive","Habs"],"not_rendered":{"charts":0,"images":2,"macros":1,"external_links":1,"defined_names":13,"comments":0,"pivot_tables":0},"unopened":[],"bounds":{"document_bytes":16777216,"sheet_cells":100000,"rows_first":2000,"rows_last":500,"rows_between":2000,"halvings":0,"cell_chars":16384,"cell_head_chars":4096},"cells_cut":0,"cells_raw":0,"read":"whole","date_system":"1900"}

{"sheet":"Data","index":0,"n_rows":30,"n_cols":40,"rows_kept":30,"cut":false,"hidden":false,"merged":[[0,14,0,15],[0,10,0,11],[1,12,1,13]]}
["Work done estimate  Part - A",null,null,null,null,null,null,null,null,null,15292,null,null,null,"Version-8",null,"1 st make csv file"]
["Dist",null,{"$f":"VLOOKUP(M2,Habs!$A$2:$H$2774,3,0)","v":"Medak"},"Mandal",{"$f":"VLOOKUP(M2,Habs!$A$2:$H$2774,5,0)","v":"Alladurg"},{"$f":"\"GP :  \"& VLOOKUP(M2,Habs!$A$2:$H$2774,6,0)","v":"GP :  Bangla Thanda"},null,null,"Habitaion",{"$f":"VLOOKUP(M2,Habs!$A$2:$H$2774,8,0)","v":"Bangla Tanda"},null,"Hab_Slno",18866,null,null,null,"2 nd Upload the life by selecting ",null,null,null,null,null,null,null,null,null,null,null,null,null,null,null,null,null,null,null,null,"distinct"]
[null,null,null,null,"Sub-Division",{"$f":"VLOOKUP(M2,Habs!$A$2:$H$2774,4,0)","v":"Medak"},"dd-mm-YYYY",null,null,null,"Please ref to the list in next tab and fill in slno ↑↑↑      ",null,null,null,null,null,"http://rwsmcs.in/updPartA.php",null,null,null,null,null,null,null,null,null,null,"Pipe","Rmt","Valve","DI Duck foot Bend","EF_Saddles","HDPE PE100 6kg",15,"PLB_DUCT","MDPE 20mm ","Each",{"$f":"IFERROR(LOOKUP(2,1/(COUNTIF($AL$2:AL2,$B$2:$B$48)=0),$B$2:$B$48),\"\")","v":0}]
["Sno","workcol","MB_No","Mb_page","Firm name","Supply/Purchase order","Order Dt","Invoice No","Invoice Dt","Item category","Item","size","Qty","units","Invoice rate","Amt Rs","VAT","GST @ 18%",null,null,null,null,null,null,null,null,null,"VerticalsDI","Each",null,"DI Bell Mouth","MC_Saddles","PVC 6kg",40,"PushFit Joint",null,"Rmt",{"$f":"IFERROR(LOOKUP(2,1/(COUNTIF($AL$2:AL3,$B$2:$B$48)=0),$B$2:$B$48),\"\")","v":"workcol"},"Unique","UniqueFirm"]
[null,null,null,null,null,null,null,null,null,null,null,null,null,null,null,null,null,null,null,null,null,null,null,null,null,null,null,"VerticalsCI","Each",null,"DI Semi Circular bend","FCV",null,63,"Endcap",null,null,{"$f":"IFERROR(LOOKUP(2,1/(COUNTIF($AL$2:AL4,$B$2:$B$48)=0),$B$2:$B$48),\"\")","v":""},{"$f":"IFERROR(INDEX($B$5:$B$43,MATCH(0,COUNTIF($AM$4:AM4,$B$5:$B$43),0)),\"\")","v":0},{"$f":"IFERROR(INDEX($E$5:$E$43,MATCH(0,COUNTIF($AN$4:AN4,$E$5:$E$43),0)),\"\")","v":0}]
[null,null,null,null,null,null,null,null,null,null,null,null,null,null,null,null,null,null,null,null,null,null,null,null,null,null,null,"Valves","Rmt",null,"DI D/F 0.6 mts Pipes","FTA",null,75,null,null,null,{"$f":"IFERROR(LOOKUP(2,1/(COUNTIF($AL$2:AL5,$B$2:$B$48)=0),$B$2:$B$48),\"\")","v":""},{"$f":"IFERROR(INDEX($B$5:$B$43,MATCH(0,COUNTIF($AM$4:AM5,$B$5:$B$43),0)),\"\")","v":""},{"$f":"IFERROR(INDEX($E$5:$E$43,MATCH(0,COUNTIF($AN$4:AN5,$E$5:$E$43),0)),\"\")","v":""}]
[null,null,null,null,null,null,null,null,null,null,null,null,null,null,null,null,null,null,null,null,null,null,null,null,null,null,null,"PLB_DUCT","Rmt",null,"DI D/F 1.0 mts Pipes","FTO",null,80,null,null,null,{"$f":"IFERROR(LOOKUP(2,1/(COUNTIF($AL$2:AL6,$B$2:$B$48)=0),$B$2:$B$48),\"\")","v":""},{"$f":"IFERROR(INDEX($B$5:$B$43,MATCH(0,COUNTIF($AM$4:AM6,$B$5:$B$43),0)),\"\")","v":""},{"$f":"IFERROR(INDEX($E$5:$E$43,MATCH(0,COUNTIF($AN$4:AN6,$E$5:$E$43),0)),\"\")","v":""}]
[null,null,null,null,null,null,null,null,null,null,null,null,null,null,null,null,null,null,null,null,null,null,null,null,null,null,null,"HH","Each",null,"DI D/F 2.0 mts Pipes","GI pipe",null,90,null,null,null,{"$f":"IFERROR(LOOKUP(2,1/(COUNTIF($AL$2:AL7,$B$2:$B$48)=0),$B$2:$B$48),\"\")","v":""},{"$f":"IFERROR(INDEX($B$5:$B$43,MATCH(0,COUNTIF($AM$4:AM7,$B$5:$B$43),0)),\"\")","v":""},{"$f":"IFERROR(INDEX($E$5:$E$43,MATCH(0,COUNTIF($AN$4:AN7,$E$5:$E$43),0)),\"\")","v":""}]
[null,null,null,null,null,null,null,null,null,null,null,null,null,null,null,null,null,null,null,null,null,null,null,null,null,null,null,null,null,null,"CI Duck foot Bend","Tap",null,100,null,null,null,{"$f":"IFERROR(LOOKUP(2,1/(COUNTIF($AL$2:AL8,$B$2:$B$48)=0),$B$2:$B$48),\"\")","v":""},{"$f":"IFERROR(INDEX($B$5:$B$43,MATCH(0,COUNTIF($AM$4:AM8,$B$5:$B$43),0)),\"\")","v":""},{"$f":"IFERROR(INDEX($E$5:$E$43,MATCH(0,COUNTIF($AN$4:AN8,$E$5:$E$43),0)),\"\")","v":""}]
[null,null,null,null,null,null,null,null,null,null,null,null,null,null,null,null,null,null,null,null,null,null,null,null,null,null,null,null,null,null,"CI Bell Mouth","MDPE",null,110,null,null,null,{"$f":"IFERROR(LOOKUP(2,1/(COUNTIF($AL$2:AL9,$B$2:$B$48)=0),$B$2:$B$48),\"\")","v":""},{"$f":"IFERROR(INDEX($B$5:$B$43,MATCH(0,COUNTIF($AM$4:AM9,$B$5:$B$43),0)),\"\")","v":""},{"$f":"IFERROR(INDEX($E$5:$E$43,MATCH(0,COUNTIF($AN$4:AN9,$E$5:$E$43),0)),\"\")","v":""}]
[null,null,null,null,null,null,null,null,null,null,null,null,null,null,null,null,null,null,null,null,null,null,null,null,null,null,null,null,null,null,"CI Semi Circular bend",null,null,125,null,null,null,{"$f":"IFERROR(LOOKUP(2,1/(COUNTIF($AL$2:AL10,$B$2:$B$48)=0),$B$2:$B$48),\"\")","v":""},{"$f":"IFERROR(INDEX($B$5:$B$43,MATCH(0,COUNTIF($AM$4:AM10,$B$5:$B$43),0)),\"\")","v":""},{"$f":"IFERROR(INDEX($E$5:$E$43,MATCH(0,COUNTIF($AN$4:AN10,$E$5:$E$43),0)),\"\")","v":""}]
[null,null,null,null,null,null,null,null,null,null,null,null,null,null,null,null,null,null,null,null,null,null,null,null,null,null,null,null,null,null,"CI D/F 0.6 mts Pipes",null,null,125,null,null,null,{"$f":"IFERROR(LOOKUP(2,1/(COUNTIF($AL$2:AL11,$B$2:$B$48)=0),$B$2:$B$48),\"\")","v":""},{"$f":"IFERROR(INDEX($B$5:$B$43,MATCH(0,COUNTIF($AM$4:AM11,$B$5:$B$43),0)),\"\")","v":""},{"$f":"IFERROR(INDEX($E$5:$E$43,MATCH(0,COUNTIF($AN$4:AN11,$E$5:$E$43),0)),\"\")","v":""}]
[null,null,null,null,null,null,null,null,null,null,null,null,null,null,null,null,null,null,null,null,null,null,null,null,null,null,null,null,null,null,"CI D/F 1.0 mts Pipes",null,null,140,null,null,null,{"$f":"IFERROR(LOOKUP(2,1/(COUNTIF($AL$2:AL12,$B$2:$B$48)=0),$B$2:$B$48),\"\")","v":""},{"$f":"IFERROR(INDEX($B$5:$B$43,MATCH(0,COUNTIF($AM$4:AM12,$B$5:$B$43),0)),\"\")","v":""},{"$f":"IFERROR(INDEX($E$5:$E$43,MATCH(0,COUNTIF($AN$4:AN12,$E$5:$E$43),0)),\"\")","v":""}]
[null,null,null,null,null,null,null,null,null,null,null,null,null,null,null,null,null,null,null,null,null,null,null,null,null,null,null,null,null,null,"CI D/F 2.0 mts Pipes",null,null,150,null,null,null,{"$f":"IFERROR(LOOKUP(2,1/(COUNTIF($AL$2:AL13,$B$2:$B$48)=0),$B$2:$B$48),\"\")","v":""},{"$f":"IFERROR(INDEX($B$5:$B$43,MATCH(0,COUNTIF($AM$4:AM13,$B$5:$B$43),0)),\"\")","v":""},{"$f":"IFERROR(INDEX($E$5:$E$43,MATCH(0,COUNTIF($AN$4:AN13,$E$5:$E$43),0)),\"\")","v":""}]
[null,null,null,null,null,null,null,null,null,null,null,null,null,null,null,null,null,null,null,null,null,null,null,null,null,null,null,null,null,null,null,null,null,160,null,null,null,{"$f":"IFERROR(LOOKUP(2,1/(COUNTIF($AL$2:AL14,$B$2:$B$48)=0),$B$2:$B$48),\"\")","v":""},{"$f":"IFERROR(INDEX($B$5:$B$43,MATCH(0,COUNTIF($AM$4:AM14,$B$5:$B$43),0)),\"\")","v":""},{"$f":"IFERROR(INDEX($E$5:$E$43,MATCH(0,COUNTIF($AN$4:AN14,$E$5:$E$43),0)),\"\")","v":""}]
[null,null,null,null,null,null,null,null,null,null,null,null,null,null,null,null,null,null,null,null,null,null,null,null,null,null,null,null,null,null,null,null,null,180,null,null,null,{"$f":"IFERROR(LOOKUP(2,1/(COUNTIF($AL$2:AL15,$B$2:$B$48)=0),$B$2:$B$48),\"\")","v":""},{"$f":"IFERROR(INDEX($B$5:$B$43,MATCH(0,COUNTIF($AM$4:AM15,$B$5:$B$43),0)),\"\")","v":""},{"$f":"IFERROR(INDEX($E$5:$E$43,MATCH(0,COUNTIF($AN$4:AN15,$E$5:$E$43),0)),\"\")","v":""}]
[null,null,null,null,null,null,null,null,null,null,null,null,null,null,null,null,null,null,null,null,null,null,null,null,null,null,null,null,null,null,null,null,null,200,null,null,null,{"$f":"IFERROR(LOOKUP(2,1/(COUNTIF($AL$2:AL16,$B$2:$B$48)=0),$B$2:$B$48),\"\")","v":""},{"$f":"IFERROR(INDEX($B$5:$B$43,MATCH(0,COUNTIF($AM$4:AM16,$B$5:$B$43),0)),\"\")","v":""},{"$f":"IFERROR(INDEX($E$5:$E$43,MATCH(0,COUNTIF($AN$4:AN16,$E$5:$E$43),0)),\"\")","v":""}]
[null,null,null,null,null,null,null,null,null,null,null,null,null,null,null,null,null,null,null,null,null,null,null,null,null,null,null,null,null,null,null,null,null,225,null,null,null,{"$f":"IFERROR(LOOKUP(2,1/(COUNTIF($AL$2:AL17,$B$2:$B$48)=0),$B$2:$B$48),\"\")","v":""},{"$f":"IFERROR(INDEX($B$5:$B$43,MATCH(0,COUNTIF($AM$4:AM17,$B$5:$B$43),0)),\"\")","v":""},{"$f":"IFERROR(INDEX($E$5:$E$43,MATCH(0,COUNTIF($AN$4:AN17,$E$5:$E$43),0)),\"\")","v":""}]
[null,null,null,null,null,null,null,null,null,null,null,null,null,null,null,null,null,null,null,null,null,null,null,null,null,null,null,null,null,null,null,null,null,250,null,null,null,{"$f":"IFERROR(LOOKUP(2,1/(COUNTIF($AL$2:AL18,$B$2:$B$48)=0),$B$2:$B$48),\"\")","v":""},{"$f":"IFERROR(INDEX($B$5:$B$43,MATCH(0,COUNTIF($AM$4:AM18,$B$5:$B$43),0)),\"\")","v":""},{"$f":"IFERROR(INDEX($E$5:$E$43,MATCH(0,COUNTIF($AN$4:AN18,$E$5:$E$43),0)),\"\")","v":""}]
[null,null,null,null,null,null,null,null,null,null,null,null,null,null,null,null,null,null,null,null,null,null,null,null,null,null,null,null,null,null,null,null,null,280,null,null,null,{"$f":"IFERROR(LOOKUP(2,1/(COUNTIF($AL$2:AL19,$B$2:$B$48)=0),$B$2:$B$48),\"\")","v":""},{"$f":"IFERROR(INDEX($B$5:$B$43,MATCH(0,COUNTIF($AM$4:AM19,$B$5:$B$43),0)),\"\")","v":""},{"$f":"IFERROR(INDEX($E$5:$E$43,MATCH(0,COUNTIF($AN$4:AN19,$E$5:$E$43),0)),\"\")","v":""}]
{"$rows_left_out":11}
{"sheet":"Firm_wise","index":1,"n_rows":12,"n_cols":16,"rows_kept":12,"cut":false,"hidden":false,"merged":[]}
[]
[null,null,"Firme wise supply"]
[]
[null,null,"     Firms->\n\nItems","total Item wise",{"$f":"Data!AN5","v":0},{"$f":"Data!AN6","v":""},{"$f":"Data!AN7","v":""},{"$f":"Data!AN8","v":""},{"$f":"Data!AN9","v":""},{"$f":"Data!AN10","v":""},{"$f":"Data!AN11","v":""},{"$f":"Data!AN12","v":""},{"$f":"Data!AN13","v":""},{"$f":"Data!AN14","v":""},{"$f":"Data!AN15","v":""},{"$f":"Data!AN16","v":""}]
[null,"Pipe","Distribution net work",{"$f":"SUM(E5:Q5)","v":0},{"$f":"SUMIFS(Data!$P$5:$P$48,Data!$J$5:$J$48,$B5,Data!$E$5:$E$48,E$4)","v":0},{"$f":"SUMIFS(Data!$P$5:$P$48,Data!$J$5:$J$48,$B5,Data!$E$5:$E$48,F$4)","v":0},{"$f":"SUMIFS(Data!$P$5:$P$48,Data!$J$5:$J$48,$B5,Data!$E$5:$E$48,G$4)","v":0},{"$f":"SUMIFS(Data!$P$5:$P$48,Data!$J$5:$J$48,$B5,Data!$E$5:$E$48,H$4)","v":0},{"$f":"SUMIFS(Data!$P$5:$P$48,Data!$J$5:$J$48,$B5,Data!$E$5:$E$48,I$4)","v":0},{"$f":"SUMIFS(Data!$P$5:$P$48,Data!$J$5:$J$48,$B5,Data!$E$5:$E$48,J$4)","v":0},{"$f":"SUMIFS(Data!$P$5:$P$48,Data!$J$5:$J$48,$B5,Data!$E$5:$E$48,K$4)","v":0},{"$f":"SUMIFS(Data!$P$5:$P$48,Data!$J$5:$J$48,$B5,Data!$E$5:$E$48,L$4)","v":0},{"$f":"SUMIFS(Data!$P$5:$P$48,Data!$J$5:$J$48,$B5,Data!$E$5:$E$48,M$4)","v":0},{"$f":"SUMIFS(Data!$P$5:$P$48,Data!$J$5:$J$48,$B5,Data!$E$5:$E$48,N$4)","v":0}]
[null,"PLB_DUCT","OFC Duct",0,{"$f":"SUMIFS(Data!$P$5:$P$48,Data!$J$5:$J$48,$B6,Data!$E$5:$E$48,E$4)","v":0},{"$f":"SUMIFS(Data!$P$5:$P$48,Data!$J$5:$J$48,$B6,Data!$E$5:$E$48,F$4)","v":0},{"$f":"SUMIFS(Data!$P$5:$P$48,Data!$J$5:$J$48,$B6,Data!$E$5:$E$48,G$4)","v":0},{"$f":"SUMIFS(Data!$P$5:$P$48,Data!$J$5:$J$48,$B6,Data!$E$5:$E$48,H$4)","v":0},{"$f":"SUMIFS(Data!$P$5:$P$48,Data!$J$5:$J$48,$B6,Data!$E$5:$E$48,I$4)","v":0},{"$f":"SUMIFS(Data!$P$5:$P$48,Data!$J$5:$J$48,$B6,Data!$E$5:$E$48,J$4)","v":0},{"$f":"SUMIFS(Data!$P$5:$P$48,Data!$J$5:$J$48,$B6,Data!$E$5:$E$48,K$4)","v":0},{"$f":"SUMIFS(Data!$P$5:$P$48,Data!$J$5:$J$48,$B6,Data!$E$5:$E$48,L$4)","v":0},{"$f":"SUMIFS(Data!$P$5:$P$48,Data!$J$5:$J$48,$B6,Data!$E$5:$E$48,M$4)","v":0},{"$f":"SUMIFS(Data!$P$5:$P$48,Data!$J$5:$J$48,$B6,Data!$E$5:$E$48,N$4)","v":0}]
[null,"HH","HH Connections",0,{"$f":"SUMIFS(Data!$P$5:$P$48,Data!$J$5:$J$48,$B7,Data!$E$5:$E$48,E$4)","v":0},{"$f":"SUMIFS(Data!$P$5:$P$48,Data!$J$5:$J$48,$B7,Data!$E$5:$E$48,F$4)","v":0},{"$f":"SUMIFS(Data!$P$5:$P$48,Data!$J$5:$J$48,$B7,Data!$E$5:$E$48,G$4)","v":0},{"$f":"SUMIFS(Data!$P$5:$P$48,Data!$J$5:$J$48,$B7,Data!$E$5:$E$48,H$4)","v":0},{"$f":"SUMIFS(Data!$P$5:$P$48,Data!$J$5:$J$48,$B7,Data!$E$5:$E$48,I$4)","v":0},{"$f":"SUMIFS(Data!$P$5:$P$48,Data!$J$5:$J$48,$B7,Data!$E$5:$E$48,J$4)","v":0},{"$f":"SUMIFS(Data!$P$5:$P$48,Data!$J$5:$J$48,$B7,Data!$E$5:$E$48,K$4)","v":0},{"$f":"SUMIFS(Data!$P$5:$P$48,Data!$J$5:$J$48,$B7,Data!$E$5:$E$48,L$4)","v":0},{"$f":"SUMIFS(Data!$P$5:$P$48,Data!$J$5:$J$48,$B7,Data!$E$5:$E$48,M$4)","v":0},{"$f":"SUMIFS(Data!$P$5:$P$48,Data!$J$5:$J$48,$B7,Data!$E$5:$E$48,N$4)","v":0}]
[null,"Valves","Valves",0,{"$f":"SUMIFS(Data!$P$5:$P$48,Data!$J$5:$J$48,$B8,Data!$E$5:$E$48,E$4)","v":0},{"$f":"SUMIFS(Data!$P$5:$P$48,Data!$J$5:$J$48,$B8,Data!$E$5:$E$48,F$4)","v":0},{"$f":"SUMIFS(Data!$P$5:$P$48,Data!$J$5:$J$48,$B8,Data!$E$5:$E$48,G$4)","v":0},{"$f":"SUMIFS(Data!$P$5:$P$48,Data!$J$5:$J$48,$B8,Data!$E$5:$E$48,H$4)","v":0},{"$f":"SUMIFS(Data!$P$5:$P$48,Data!$J$5:$J$48,$B8,Data!$E$5:$E$48,I$4)","v":0},{"$f":"SUMIFS(Data!$P$5:$P$48,Data!$J$5:$J$48,$B8,Data!$E$5:$E$48,J$4)","v":0},{"$f":"SUMIFS(Data!$P$5:$P$48,Data!$J$5:$J$48,$B8,Data!$E$5:$E$48,K$4)","v":0},{"$f":"SUMIFS(Data!$P$5:$P$48,Data!$J$5:$J$48,$B8,Data!$E$5:$E$48,L$4)","v":0},{"$f":"SUMIFS(Data!$P$5:$P$48,Data!$J$5:$J$48,$B8,Data!$E$5:$E$48,M$4)","v":0},{"$f":"SUMIFS(Data!$P$5:$P$48,Data!$J$5:$J$48,$B8,Data!$E$5:$E$48,N$4)","v":0}]
[null,"VerticalsCI","VerticalsCI",0,{"$f":"SUMIFS(Data!$P$5:$P$48,Data!$J$5:$J$48,$B9,Data!$E$5:$E$48,E$4)","v":0},{"$f":"SUMIFS(Data!$P$5:$P$48,Data!$J$5:$J$48,$B9,Data!$E$5:$E$48,F$4)","v":0},{"$f":"SUMIFS(Data!$P$5:$P$48,Data!$J$5:$J$48,$B9,Data!$E$5:$E$48,G$4)","v":0},{"$f":"SUMIFS(Data!$P$5:$P$48,Data!$J$5:$J$48,$B9,Data!$E$5:$E$48,H$4)","v":0},{"$f":"SUMIFS(Data!$P$5:$P$48,Data!$J$5:$J$48,$B9,Data!$E$5:$E$48,I$4)","v":0},{"$f":"SUMIFS(Data!$P$5:$P$48,Data!$J$5:$J$48,$B9,Data!$E$5:$E$48,J$4)","v":0},{"$f":"SUMIFS(Data!$P$5:$P$48,Data!$J$5:$J$48,$B9,Data!$E$5:$E$48,K$4)","v":0},{"$f":"SUMIFS(Data!$P$5:$P$48,Data!$J$5:$J$48,$B9,Data!$E$5:$E$48,L$4)","v":0},{"$f":"SUMIFS(Data!$P$5:$P$48,Data!$J$5:$J$48,$B9,Data!$E$5:$E$48,M$4)","v":0},{"$f":"SUMIFS(Data!$P$5:$P$48,Data!$J$5:$J$48,$B9,Data!$E$5:$E$48,N$4)","v":0}]
[null,"VerticalsDI","VerticalsDI",0,{"$f":"SUMIFS(Data!$P$5:$P$48,Data!$J$5:$J$48,$B10,Data!$E$5:$E$48,E$4)","v":0},{"$f":"SUMIFS(Data!$P$5:$P$48,Data!$J$5:$J$48,$B10,Data!$E$5:$E$48,F$4)","v":0},{"$f":"SUMIFS(Data!$P$5:$P$48,Data!$J$5:$J$48,$B10,Data!$E$5:$E$48,G$4)","v":0},{"$f":"SUMIFS(Data!$P$5:$P$48,Data!$J$5:$J$48,$B10,Data!$E$5:$E$48,H$4)","v":0},{"$f":"SUMIFS(Data!$P$5:$P$48,Data!$J$5:$J$48,$B10,Data!$E$5:$E$48,I$4)","v":0},{"$f":"SUMIFS(Data!$P$5:$P$48,Data!$J$5:$J$48,$B10,Data!$E$5:$E$48,J$4)","v":0},{"$f":"SUMIFS(Data!$P$5:$P$48,Data!$J$5:$J$48,$B10,Data!$E$5:$E$48,K$4)","v":0},{"$f":"SUMIFS(Data!$P$5:$P$48,Data!$J$5:$J$48,$B10,Data!$E$5:$E$48,L$4)","v":0},{"$f":"SUMIFS(Data!$P$5:$P$48,Data!$J$5:$J$48,$B10,Data!$E$5:$E$48,M$4)","v":0},{"$f":"SUMIFS(Data!$P$5:$P$48,Data!$J$5:$J$48,$B10,Data!$E$5:$E$48,N$4)","v":0}]
[]
[null,null,null,{"$f":"SUM(D5:D11)","v":0},{"$f":"SUM(E5:E11)","v":0},{"$f":"SUM(F5:F11)","v":0},0,0,0,0,0,0,0,0]

{"sheet":"Comparitive","index":2,"n_rows":70,"n_cols":13,"rows_kept":70,"cut":false,"hidden":false,"merged":[[0,0,0,7],[5,3,5,4],[4,5,4,7],[4,8,4,10]]}
["Work done estimate  Part - A ( ABSTRACT )"]
[null,null,null,"District",{"$f":"Data!C2","v":"Medak"},null,"Mandal",{"$f":"VLOOKUP(H4,Habs!$A$2:$H$2774,5,0)","v":"Alladurg"}]
[null,null,null,"GP",{"$f":"VLOOKUP(H4,Habs!$A$2:$H$2774,6,0)","v":"Bangla Thanda"},null,"Habitaion",{"$f":"VLOOKUP(H4,Habs!$A$2:$H$2774,7,0)","v":"Bangla Thanda"}]
[null,null,null,"Sub division",{"$f":"VLOOKUP(H4,Habs!$A$2:$H$2774,4,0)","v":"Medak"},null,"Hab slno",{"$f":"Data!M2","v":18866}]
[null,null,null,null,null,"As per working estimate",null,null,"As per work done"]
["Slno",null,null,"Desc",null,"QTY","Rate","Amount","QTY","Rate","Amount","Excess","less"]
[1,{"$f":"Data!AM5","v":0},{"$f":"IF(D7=\"\",\"\",D7&\",\"&E7)","v":""},{"$f":"IFERROR(LEFT(B7,FIND(\",\",B7,1)-1),\"\")","v":""},{"$f":"IFERROR(MID(B7,FIND(\",\",B7)+1,FIND(\",\",B7,FIND(\",\",B7)+2)-FIND(\",\",B7)-1),\"\")","v":""},null,null,null,{"$f":"IF(B7=\"\",\"\",(SUMIF(Data!$B$4:$B$48,B7,Data!$M$4:$M$48)))","v":0},{"$f":"IFERROR(RIGHT(B7,LEN(B7)-FIND(\",\",B7,FIND(\",\",B7)+2)),\"\")","v":""},{"$f":"IFERROR(I7*J7,\"\")","v":""},{"$f":"IFERROR(IF(K7-H7<0,\"\",K7-H7),\"\")","v":""},{"$f":"IFERROR(IF(H7-K7>0,H7-K7,\"\"),\"\")","v":""}]
[{"$f":"A7+1","v":2},{"$f":"Data!AM6","v":""},{"$f":"IF(D8=\"\",\"\",D8&\",\"&E8)","v":""},{"$f":"IFERROR(LEFT(B8,FIND(\",\",B8,1)-1),\"\")","v":""},{"$f":"IFERROR(MID(B8,FIND(\",\",B8)+1,FIND(\",\",B8,FIND(\",\",B8)+2)-FIND(\",\",B8)-1),\"\")","v":""},null,null,null,{"$f":"IF(B8=\"\",\"\",(SUMIF(Data!$B$4:$B$48,B8,Data!$M$4:$M$48)))","v":""},"",{"$f":"IFERROR(I8*J8,\"\")","v":""}]
[{"$f":"A8+1","v":3},{"$f":"Data!AM7","v":""},"","","",null,null,null,{"$f":"IF(B9=\"\",\"\",(SUMIF(Data!$B$4:$B$48,B9,Data!$M$4:$M$48)))","v":""},"",""]
[{"$f":"A9+1","v":4},{"$f":"Data!AM8","v":""},"","","",null,null,null,{"$f":"IF(B10=\"\",\"\",(SUMIF(Data!$B$4:$B$48,B10,Data!$M$4:$M$48)))","v":""},"",""]
[5,{"$f":"Data!AM9","v":""},"","","",null,null,null,{"$f":"IF(B11=\"\",\"\",(SUMIF(Data!$B$4:$B$48,B11,Data!$M$4:$M$48)))","v":""},"",""]
[6,{"$f":"Data!AM10","v":""},"","","",null,null,null,{"$f":"IF(B12=\"\",\"\",(SUMIF(Data!$B$4:$B$48,B12,Data!$M$4:$M$48)))","v":""},"",""]
[7,{"$f":"Data!AM11","v":""},"","","",null,null,null,{"$f":"IF(B13=\"\",\"\",(SUMIF(Data!$B$4:$B$48,B13,Data!$M$4:$M$48)))","v":""},"",""]
[8,{"$f":"Data!AM12","v":""},"","","",null,null,null,{"$f":"IF(B14=\"\",\"\",(SUMIF(Data!$B$4:$B$48,B14,Data!$M$4:$M$48)))","v":""},"",""]
[9,{"$f":"Data!AM13","v":""},"","","",null,null,null,{"$f":"IF(B15=\"\",\"\",(SUMIF(Data!$B$4:$B$48,B15,Data!$M$4:$M$48)))","v":""},"",""]
[10,{"$f":"Data!AM14","v":""},"","","",null,null,null,{"$f":"IF(B16=\"\",\"\",(SUMIF(Data!$B$4:$B$48,B16,Data!$M$4:$M$48)))","v":""},"",""]
[11,{"$f":"Data!AM15","v":""},"","","",null,null,null,{"$f":"IF(B17=\"\",\"\",(SUMIF(Data!$B$4:$B$48,B17,Data!$M$4:$M$48)))","v":""},"",""]
[12,{"$f":"Data!AM16","v":""},"","","",null,null,null,{"$f":"IF(B18=\"\",\"\",(SUMIF(Data!$B$4:$B$48,B18,Data!$M$4:$M$48)))","v":""},"",""]
[13,{"$f":"Data!AM17","v":""},"","","",null,null,null,{"$f":"IF(B19=\"\",\"\",(SUMIF(Data!$B$4:$B$48,B19,Data!$M$4:$M$48)))","v":""},"",""]
[14,{"$f":"Data!AM18","v":""},"","","",null,null,null,{"$f":"IF(B20=\"\",\"\",(SUMIF(Data!$B$4:$B$48,B20,Data!$M$4:$M$48)))","v":""},"",""]
{"$rows_left_out":51}
{"sheet":"Habs","index":3,"n_rows":2774,"n_cols":8,"rows_kept":2774,"cut":false,"hidden":false,"merged":[]}
[1,{"$f":"A1+1","v":2},{"$f":"B1+1","v":3},4,5,6,7,8]
["sl_no","New_Habcode","MB_Dist.","SD","MB_Mandal","MB_GP","Mb_Village","MB_Hab"]
[18885,"1722707004020800","Medak","Medak","Alladurg","Mahammadapur","Mohammadipur","Chowtavagu Thanda"]
[18898,"1722707001030300","Medak","Medak","Alladurg","Seethanagar","Seethanagar","Sethanagar Thanda"]
[18877,"1722707005020900","Medak","Medak","Alladurg","Chilever","Chilver","Pallegadda"]
[18878,"1722907010021400","Medak","Medak","Alladurg","Gadipeddapur","Gadipeddapur","Gadipeddapur I"]
[18869,"1722707002030600","Medak","Medak","Alladurg","Appajipally","Appajipally","Appajipally Lt"]
[18886,"1722707004030800","Medak","Medak","Alladurg","Gollakunta Thanda","Gollakunta Thanda","Kommatikunta Thanda"]
[18891,"1722907006021000","Medak","Medak","Alladurg","Muslapur","Muslapur","Muslapur Lt"]
[18867,"1722707001030100","Medak","Medak","Alladurg","Bangla Thanda","Bangla Thanda","Gandlabai Thanda"]
[18871,"1722707002020600","Medak","Medak","Alladurg","Appajipally","Appajipally","Neelkantpally"]
[18889,"1722707003020700","Medak","Medak","Alladurg","Muparram","Mupparam","Mupparam Lt"]
[18868,"1722707001080100","Medak","Medak","Alladurg","Gollakunta Thanda","Gollakunta Thanda","Gollakunta Thanda"]
[18866,"1722707001010104","Medak","Medak","Alladurg","Bangla Thanda","Bangla Thanda","Bangla Tanda"]
[18897,"1722707001040300","Medak","Medak","Alladurg","Seethanagar","Seethanagar","Seethanagar"]
[18870,"1722707002010600","Medak","Medak","Alladurg","Appajipally","Appajipally","Appajipally"]
[18883,"1722707004010400","Medak","Medak","Alladurg","Kaidampally","Kaidampally","Kaidampally"]
[18900,"1722707001010200","Medak","Medak","Alladurg","Venkatraopet","Venkatraopet","Venkatraopet"]
[18899,"1722707003010500","Medak","Medak","Alladurg","Reddipally","Reddypally","Reddypally"]
[18887,"1722707004010800","Medak","Medak","Alladurg","Mahammadapur","Mohammadipur","Mohammadepur"]
{"$rows_left_out":2754}